LAPACK Archives

[Lapack] Build Errors On Run - Test Module of CLAPACK - cmake build on w

Support,Below is the error on?CLAPACK build on ?MSVc 2013 - 64bit.?Can i still 
use the?CLAPACK with this build errors. See Below: Help.
?1>------ Build started: Project: RUN_TESTS, Configuration: Debug x64 ------1> 
?Test project 
C:/Users/One/Desktop/Project/BLAS/clapack-3.2.1-CMAKE/BUILDBLAS3211> ? ? ? 
?Start ?1: xblat1s1> ? 1/94 Test ?#1: xblat1s .......................... ? 
Passed ? ?0.21 sec1> ? ? ? ?Start ?2: xblat1c1> ? 2/94 Test ?#2: xblat1c 
.......................... ? Passed ? ?0.17 sec1> ? ? ? ?Start ?3: xblat1d1> ? 
3/94 Test ?#3: xblat1d .......................... ? Passed ? ?0.07 sec1> ? ? ? 
?Start ?4: xblat1z1> ? 4/94 Test ?#4: xblat1z .......................... ? 
Passed ? ?0.17 sec1> ? ? ? ?Start ?5: xblat2s1> ? 5/94 Test ?#5: xblat2s 
.......................... ? Passed ? ?0.30 sec1> ? ? ? ?Start ?6: xblat2c1> ? 
6/94 Test ?#6: xblat2c .......................... ? Passed ? ?0.29 sec1> ? ? ? 
?Start ?7: xblat2d1> ? 7/94 Test ?#7: xblat2d .......................... ? 
Passed ? ?0.27 sec1> ? ? ? ?Start ?8: xblat2z1> ? 8/94 Test ?#8: xblat2z 
.......................... ? Passed ? ?0.24 sec1> ? ? ? ?Start ?9: xblat3s1> ? 
9/94 Test ?#9: xblat3s .......................... ? Passed ? ?0.16 sec1> ? ? ? 
?Start 10: xblat3c1> ?10/94 Test #10: xblat3c .......................... ? 
Passed ? ?0.32 sec1> ? ? ? ?Start 11: xblat3d1> ?11/94 Test #11: xblat3d 
.......................... ? Passed ? ?0.17 sec1> ? ? ? ?Start 12: xblat3z1> 
?12/94 Test #12: xblat3z .......................... ? Passed ? ?0.34 sec1> ? ? 
? ?Start 13: xlintsts_stest_in1> ?13/94 Test #13: xlintsts_stest_in 
................ ? Passed ? 11.80 sec1> ? ? ? ?Start 14: xlintstc_ctest_in1> 
?14/94 Test #14: xlintstc_ctest_in ................***Failed ? ?1.26 sec1> ? ? 
? ?Start 15: xlintstd_dtest_in1> ?15/94 Test #15: xlintstd_dtest_in 
................***Failed ? ?1.01 sec1> ? ? ? ?Start 16: xlintstz_ztest_in1> 
?16/94 Test #16: xlintstz_ztest_in ................***Failed ? ?1.15 sec1> ? ? 
? ?Start 17: xlintstds_dstest_in1> ?17/94 Test #17: xlintstds_dstest_in 
.............. ? Passed ? ?3.13 sec1> ? ? ? ?Start 18: xlintstzc_zctest_in1> 
?18/94 Test #18: xlintstzc_zctest_in .............. ? Passed ? ?8.33 sec1> ? ? 
? ?Start 19: xlintstrfs_stest_rfp_in1> ?19/94 Test #19: xlintstrfs_stest_rfp_in 
.......... ? Passed ? ?1.23 sec1> ? ? ? ?Start 20: xlintstrfd_dtest_rfp_in1> 
?20/94 Test #20: xlintstrfd_dtest_rfp_in .......... ? Passed ? ?1.28 sec1> ? ? 
? ?Start 21: xlintstrfc_ctest_rfp_in1> ?21/94 Test #21: xlintstrfc_ctest_rfp_in 
.......... ? Passed ? ?3.75 sec1> ? ? ? ?Start 22: xlintstrfz_ztest_rfp_in1> 
?22/94 Test #22: xlintstrfz_ztest_rfp_in .......... ? Passed ? ?3.85 sec1> ? ? 
? ?Start 23: xeigtsts_nep_in1> ?23/94 Test #23: xeigtsts_nep_in 
..................***Failed ? ?1.63 sec1> ? ? ? ?Start 24: xeigtsts_sep_in1> 
?24/94 Test #24: xeigtsts_sep_in ..................***Failed ? ?0.95 sec1> ? ? 
? ?Start 25: xeigtsts_svd_in1> ?25/94 Test #25: xeigtsts_svd_in 
..................***Failed ? ?0.99 sec1> ? ? ? ?Start 26: xeigtsts_sec_in1> 
?26/94 Test #26: xeigtsts_sec_in ..................***Failed ? ?0.98 sec1> ? ? 
? ?Start 27: xeigtsts_sed_in1> ?27/94 Test #27: xeigtsts_sed_in 
..................***Failed ? ?0.98 sec1> ? ? ? ?Start 28: xeigtsts_sgg_in1> 
?28/94 Test #28: xeigtsts_sgg_in ..................***Failed ? ?0.97 sec1> ? ? 
? ?Start 29: xeigtsts_sgd_in1> ?29/94 Test #29: xeigtsts_sgd_in 
..................***Failed ? ?1.03 sec1> ? ? ? ?Start 30: xeigtsts_ssb_in1> 
?30/94 Test #30: xeigtsts_ssb_in ..................***Failed ? ?0.98 sec1> ? ? 
? ?Start 31: xeigtsts_ssg_in1> ?31/94 Test #31: xeigtsts_ssg_in 
..................***Failed ? ?0.99 sec1> ? ? ? ?Start 32: xeigtsts_sbal_in1> 
?32/94 Test #32: xeigtsts_sbal_in .................***Failed ? ?1.01 sec1> ? ? 
? ?Start 33: xeigtsts_sbak_in1> ?33/94 Test #33: xeigtsts_sbak_in 
.................***Failed ? ?0.98 sec1> ? ? ? ?Start 34: xeigtsts_sgbal_in1> 
?34/94 Test #34: xeigtsts_sgbal_in ................***Failed ? ?1.00 sec1> ? ? 
? ?Start 35: xeigtsts_sgbak_in1> ?35/94 Test #35: xeigtsts_sgbak_in 
................***Failed ? ?0.99 sec1> ? ? ? ?Start 36: xeigtsts_sbb_in1> 
?36/94 Test #36: xeigtsts_sbb_in ..................***Failed ? ?1.05 sec1> ? ? 
? ?Start 37: xeigtsts_glm_in1> ?37/94 Test #37: xeigtsts_glm_in 
..................***Failed ? ?1.03 sec1> ? ? ? ?Start 38: xeigtsts_gqr_in1> 
?38/94 Test #38: xeigtsts_gqr_in ..................***Failed ? ?0.96 sec1> ? ? 
? ?Start 39: xeigtsts_gsv_in1> ?39/94 Test #39: xeigtsts_gsv_in 
..................***Failed ? ?1.02 sec1> ? ? ? ?Start 40: xeigtsts_lse_in1> 
?40/94 Test #40: xeigtsts_lse_in ..................***Failed ? ?0.98 sec1> ? ? 
? ?Start 41: xeigtstc_nep_in1> ?41/94 Test #41: xeigtstc_nep_in 
..................***Failed ? ?1.26 sec1> ? ? ? ?Start 42: xeigtstc_sep_in1> 
?42/94 Test #42: xeigtstc_sep_in ..................***Failed ? ?1.04 sec1> ? ? 
? ?Start 43: xeigtstc_svd_in1> ?43/94 Test #43: xeigtstc_svd_in 
..................***Failed ? ?0.95 sec1> ? ? ? ?Start 44: xeigtstc_cec_in1> 
?44/94 Test #44: xeigtstc_cec_in ..................***Failed ? ?1.08 sec1> ? ? 
? ?Start 45: xeigtstc_ced_in1> ?45/94 Test #45: xeigtstc_ced_in 
..................***Failed ? ?1.00 sec1> ? ? ? ?Start 46: xeigtstc_cgg_in1> 
?46/94 Test #46: xeigtstc_cgg_in ..................***Failed ? ?1.02 sec1> ? ? 
? ?Start 47: xeigtstc_cgd_in1> ?47/94 Test #47: xeigtstc_cgd_in 
..................***Failed ? ?1.00 sec1> ? ? ? ?Start 48: xeigtstc_csb_in1> 
?48/94 Test #48: xeigtstc_csb_in ..................***Failed ? ?0.98 sec1> ? ? 
? ?Start 49: xeigtstc_csg_in1> ?49/94 Test #49: xeigtstc_csg_in 
..................***Failed ? ?0.97 sec1> ? ? ? ?Start 50: xeigtstc_cbal_in1> 
?50/94 Test #50: xeigtstc_cbal_in .................***Failed ? ?1.05 sec1> ? ? 
? ?Start 51: xeigtstc_cbak_in1> ?51/94 Test #51: xeigtstc_cbak_in 
.................***Failed ? ?0.99 sec1> ? ? ? ?Start 52: xeigtstc_cgbal_in1> 
?52/94 Test #52: xeigtstc_cgbal_in ................***Failed ? ?1.20 sec1> ? ? 
? ?Start 53: xeigtstc_cgbak_in1> ?53/94 Test #53: xeigtstc_cgbak_in 
................***Failed ? ?1.02 sec1> ? ? ? ?Start 54: xeigtstc_cbb_in1> 
?54/94 Test #54: xeigtstc_cbb_in ..................***Failed ? ?1.03 sec1> ? ? 
? ?Start 55: xeigtstc_glm_in1> ?55/94 Test #55: xeigtstc_glm_in 
..................***Failed ? ?0.99 sec1> ? ? ? ?Start 56: xeigtstc_gqr_in1> 
?56/94 Test #56: xeigtstc_gqr_in ..................***Failed ? ?1.01 sec1> ? ? 
? ?Start 57: xeigtstc_gsv_in1> ?57/94 Test #57: xeigtstc_gsv_in 
..................***Failed ? ?1.04 sec1> ? ? ? ?Start 58: xeigtstc_lse_in1> 
?58/94 Test #58: xeigtstc_lse_in ..................***Failed ? ?0.99 sec1> ? ? 
? ?Start 59: xeigtstd_nep_in1> ?59/94 Test #59: xeigtstd_nep_in 
..................***Failed ? ?1.16 sec1> ? ? ? ?Start 60: xeigtstd_sep_in1> 
?60/94 Test #60: xeigtstd_sep_in ..................***Failed ? ?1.03 sec1> ? ? 
? ?Start 61: xeigtstd_svd_in1> ?61/94 Test #61: xeigtstd_svd_in 
..................***Failed ? ?0.99 sec1> ? ? ? ?Start 62: xeigtstd_dec_in1> 
?62/94 Test #62: xeigtstd_dec_in ..................***Failed ? ?1.04 sec1> ? ? 
? ?Start 63: xeigtstd_ded_in1> ?63/94 Test #63: xeigtstd_ded_in 
..................***Failed ? ?1.01 sec1> ? ? ? ?Start 64: xeigtstd_dgg_in1> 
?64/94 Test #64: xeigtstd_dgg_in ..................***Failed ? ?1.07 sec1> ? ? 
? ?Start 65: xeigtstd_dgd_in1> ?65/94 Test #65: xeigtstd_dgd_in 
..................***Failed ? ?1.11 sec1> ? ? ? ?Start 66: xeigtstd_dsb_in1> 
?66/94 Test #66: xeigtstd_dsb_in ..................***Failed ? ?1.03 sec1> ? ? 
? ?Start 67: xeigtstd_dsg_in1> ?67/94 Test #67: xeigtstd_dsg_in 
..................***Failed ? ?1.00 sec1> ? ? ? ?Start 68: xeigtstd_dbal_in1> 
?68/94 Test #68: xeigtstd_dbal_in .................***Failed ? ?0.95 sec1> ? ? 
? ?Start 69: xeigtstd_dbak_in1> ?69/94 Test #69: xeigtstd_dbak_in 
.................***Failed ? ?1.16 sec1> ? ? ? ?Start 70: xeigtstd_dgbal_in1> 
?70/94 Test #70: xeigtstd_dgbal_in ................***Failed ? ?1.01 sec1> ? ? 
? ?Start 71: xeigtstd_dgbak_in1> ?71/94 Test #71: xeigtstd_dgbak_in 
................***Failed ? ?1.00 sec1> ? ? ? ?Start 72: xeigtstd_dbb_in1> 
?72/94 Test #72: xeigtstd_dbb_in ..................***Failed ? ?0.99 sec1> ? ? 
? ?Start 73: xeigtstd_glm_in1> ?73/94 Test #73: xeigtstd_glm_in 
..................***Failed ? ?1.00 sec1> ? ? ? ?Start 74: xeigtstd_gqr_in1> 
?74/94 Test #74: xeigtstd_gqr_in ..................***Failed ? ?0.98 sec1> ? ? 
? ?Start 75: xeigtstd_gsv_in1> ?75/94 Test #75: xeigtstd_gsv_in 
..................***Failed ? ?1.00 sec1> ? ? ? ?Start 76: xeigtstd_lse_in1> 
?76/94 Test #76: xeigtstd_lse_in ..................***Failed ? ?1.02 sec1> ? ? 
? ?Start 77: xeigtstz_nep_in1> ?77/94 Test #77: xeigtstz_nep_in 
..................***Failed ? ?1.29 sec1> ? ? ? ?Start 78: xeigtstz_sep_in1> 
?78/94 Test #78: xeigtstz_sep_in ..................***Failed ? ?1.01 sec1> ? ? 
? ?Start 79: xeigtstz_svd_in1> ?79/94 Test #79: xeigtstz_svd_in 
..................***Failed ? ?1.03 sec1> ? ? ? ?Start 80: xeigtstz_zec_in1> 
?80/94 Test #80: xeigtstz_zec_in ..................***Failed ? ?1.00 sec1> ? ? 
? ?Start 81: xeigtstz_zed_in1> ?81/94 Test #81: xeigtstz_zed_in 
..................***Failed ? ?1.23 sec1> ? ? ? ?Start 82: xeigtstz_zgg_in1> 
?82/94 Test #82: xeigtstz_zgg_in ..................***Failed ? ?1.01 sec1> ? ? 
? ?Start 83: xeigtstz_zgd_in1> ?83/94 Test #83: xeigtstz_zgd_in 
..................***Failed ? ?1.13 sec1> ? ? ? ?Start 84: xeigtstz_zsb_in1> 
?84/94 Test #84: xeigtstz_zsb_in ..................***Failed ? ?1.02 sec1> ? ? 
? ?Start 85: xeigtstz_zsg_in1> ?85/94 Test #85: xeigtstz_zsg_in 
..................***Failed ? ?1.00 sec1> ? ? ? ?Start 86: xeigtstz_zbal_in1> 
?86/94 Test #86: xeigtstz_zbal_in .................***Failed ? ?1.00 sec1> ? ? 
? ?Start 87: xeigtstz_zbak_in1> ?87/94 Test #87: xeigtstz_zbak_in 
.................***Failed ? ?1.02 sec1> ? ? ? ?Start 88: xeigtstz_zgbal_in1> 
?88/94 Test #88: xeigtstz_zgbal_in ................***Failed ? ?0.99 sec1> ? ? 
? ?Start 89: xeigtstz_zgbak_in1> ?89/94 Test #89: xeigtstz_zgbak_in 
................***Failed ? ?1.00 sec1> ? ? ? ?Start 90: xeigtstz_zbb_in1> 
?90/94 Test #90: xeigtstz_zbb_in ..................***Failed ? ?1.17 sec1> ? ? 
? ?Start 91: xeigtstz_glm_in1> ?91/94 Test #91: xeigtstz_glm_in 
..................***Failed ? ?1.02 sec1> ? ? ? ?Start 92: xeigtstz_gqr_in1> 
?92/94 Test #92: xeigtstz_gqr_in ..................***Failed ? ?1.02 sec1> ? ? 
? ?Start 93: xeigtstz_gsv_in1> ?93/94 Test #93: xeigtstz_gsv_in 
..................***Failed ? ?0.99 sec1> ? ? ? ?Start 94: xeigtstz_lse_in1> 
?94/94 Test #94: xeigtstz_lse_in ..................***Failed ? ?0.99 sec1> ?1> 
?20% tests passed, 75 tests failed out of 941> ?1> ?Total Test time (real) = 
114.41 sec1> ?1> ?The following tests FAILED:1> ?  14 - xlintstc_ctest_in 
(Failed)1> ?  15 - xlintstd_dtest_in (Failed)1> ?  16 - xlintstz_ztest_in 
(Failed)1> ?  23 - xeigtsts_nep_in (Failed)1> ?  24 - xeigtsts_sep_in 
(Failed)1> ?  25 - xeigtsts_svd_in (Failed)1> ?  26 - xeigtsts_sec_in 
(Failed)1> ?  27 - xeigtsts_sed_in (Failed)1> ?  28 - xeigtsts_sgg_in 
(Failed)1> ?  29 - xeigtsts_sgd_in (Failed)1> ?  30 - xeigtsts_ssb_in 
(Failed)1> ?  31 - xeigtsts_ssg_in (Failed)1> ?  32 - xeigtsts_sbal_in 
(Failed)1> ?  33 - xeigtsts_sbak_in (Failed)1> ?  34 - xeigtsts_sgbal_in 
(Failed)1> ?  35 - xeigtsts_sgbak_in (Failed)1> ?  36 - xeigtsts_sbb_in 
(Failed)1> ?  37 - xeigtsts_glm_in (Failed)1> ?  38 - xeigtsts_gqr_in 
(Failed)1> ?  39 - xeigtsts_gsv_in (Failed)1> ?  40 - xeigtsts_lse_in 
(Failed)1> ?  41 - xeigtstc_nep_in (Failed)1> ?  42 - xeigtstc_sep_in 
(Failed)1> ?  43 - xeigtstc_svd_in (Failed)1> ?  44 - xeigtstc_cec_in 
(Failed)1> ?  45 - xeigtstc_ced_in (Failed)1> ?  46 - xeigtstc_cgg_in 
(Failed)1> ?  47 - xeigtstc_cgd_in (Failed)1> ?  48 - xeigtstc_csb_in 
(Failed)1> ?  49 - xeigtstc_csg_in (Failed)1> ?  50 - xeigtstc_cbal_in 
(Failed)1> ?  51 - xeigtstc_cbak_in (Failed)1> ?  52 - xeigtstc_cgbal_in 
(Failed)1> ?  53 - xeigtstc_cgbak_in (Failed)1> ?  54 - xeigtstc_cbb_in 
(Failed)1> ?  55 - xeigtstc_glm_in (Failed)1> ?  56 - xeigtstc_gqr_in 
(Failed)1> ?  57 - xeigtstc_gsv_in (Failed)1> ?  58 - xeigtstc_lse_in 
(Failed)1> ?  59 - xeigtstd_nep_in (Failed)1> ?  60 - xeigtstd_sep_in 
(Failed)1> ?  61 - xeigtstd_svd_in (Failed)1> ?  62 - xeigtstd_dec_in 
(Failed)1> ?  63 - xeigtstd_ded_in (Failed)1> ?  64 - xeigtstd_dgg_in 
(Failed)1> ?  65 - xeigtstd_dgd_in (Failed)1> ?  66 - xeigtstd_dsb_in 
(Failed)1> ?  67 - xeigtstd_dsg_in (Failed)1> ?  68 - xeigtstd_dbal_in 
(Failed)1> ?  69 - xeigtstd_dbak_in (Failed)1> ?  70 - xeigtstd_dgbal_in 
(Failed)1> ?  71 - xeigtstd_dgbak_in (Failed)1> ?  72 - xeigtstd_dbb_in 
(Failed)1> ?  73 - xeigtstd_glm_in (Failed)1> ?  74 - xeigtstd_gqr_in 
(Failed)1> ?  75 - xeigtstd_gsv_in (Failed)1> ?  76 - xeigtstd_lse_in 
(Failed)1> ?  77 - xeigtstz_nep_in (Failed)1> ?  78 - xeigtstz_sep_in 
(Failed)1> ?  79 - xeigtstz_svd_in (Failed)1> ?  80 - xeigtstz_zec_in 
(Failed)1> ?  81 - xeigtstz_zed_in (Failed)1> ?  82 - xeigtstz_zgg_in 
(Failed)1> ?  83 - xeigtstz_zgd_in (Failed)1> ?  84 - xeigtstz_zsb_in 
(Failed)1> ?  85 - xeigtstz_zsg_in (Failed)1> ?  86 - xeigtstz_zbal_in 
(Failed)1> ?  87 - xeigtstz_zbak_in (Failed)1> ?  88 - xeigtstz_zgbal_in 
(Failed)1> ?  89 - xeigtstz_zgbak_in (Failed)1> ?  90 - xeigtstz_zbb_in 
(Failed)1> ?  91 - xeigtstz_glm_in (Failed)1> ?  92 - xeigtstz_gqr_in 
(Failed)1> ?  93 - xeigtstz_gsv_in (Failed)1> ?  94 - xeigtstz_lse_in 
(Failed)1> ?Errors while running CTest1>C:\Program Files 
(x86)\MSBuild\Microsoft.Cpp\v4.0\V120\Microsoft.CppCommon.targets(132,5): error 
MSB3073: The command "setlocal1>C:\Program Files 
(x86)\MSBuild\Microsoft.Cpp\v4.0\V120\Microsoft.CppCommon.targets(132,5): error 
MSB3073: "C:\Program Files (x86)\CMake 2.8\bin\ctest.exe" 
--force-new-ctest-process -C Debug1>C:\Program Files 
(x86)\MSBuild\Microsoft.Cpp\v4.0\V120\Microsoft.CppCommon.targets(132,5): error 
MSB3073: if %errorlevel% neq 0 goto :cmEnd1>C:\Program Files 
(x86)\MSBuild\Microsoft.Cpp\v4.0\V120\Microsoft.CppCommon.targets(132,5): error 
MSB3073: :cmEnd1>C:\Program Files 
(x86)\MSBuild\Microsoft.Cpp\v4.0\V120\Microsoft.CppCommon.targets(132,5): error 
MSB3073: endlocal & call :cmErrorLevel %errorlevel% & goto :cmDone1>C:\Program 
Files (x86)\MSBuild\Microsoft.Cpp\v4.0\V120\Microsoft.CppCommon.targets(132,5): 
error MSB3073: :cmErrorLevel1>C:\Program Files 
(x86)\MSBuild\Microsoft.Cpp\v4.0\V120\Microsoft.CppCommon.targets(132,5): error 
MSB3073: exit /b %11>C:\Program Files 
(x86)\MSBuild\Microsoft.Cpp\v4.0\V120\Microsoft.CppCommon.targets(132,5): error 
MSB3073: :cmDone1>C:\Program Files 
(x86)\MSBuild\Microsoft.Cpp\v4.0\V120\Microsoft.CppCommon.targets(132,5): error 
MSB3073: if %errorlevel% neq 0 goto :VCEnd1>C:\Program Files 
(x86)\MSBuild\Microsoft.Cpp\v4.0\V120\Microsoft.CppCommon.targets(132,5): error 
MSB3073: :VCEnd" exited with code 8.========== Build: 0 succeeded, 1 failed, 0 
up-to-date, 0 skipped ==========
?Regards,Tini?
-------------- next part --------------
An HTML attachment was scrubbed...
URL: 
<http://lists.eecs.utk.edu/mailman/private/lapack/attachments/20150502/dde9dae7/attachment-0001.html>
-------------- next part --------------
An embedded and charset-unspecified text was scrubbed...
Name: CPLACK DUMP.txt
URL: 
<http://lists.eecs.utk.edu/mailman/private/lapack/attachments/20150502/dde9dae7/CPLACKDUMP-0001.txt>

<Prev in Thread] Current Thread [Next in Thread>


For additional information you may use the LAPACK/ScaLAPACK Forum.
Or one of the mailing lists, or