error happened when did "C:\mingw64\bin\mingw32-make.exe tes

Post here if you are having problem installing LAPACK on a Windows machine

error happened when did "C:\mingw64\bin\mingw32-make.exe tes

Postby wgf08062015 » Mon Jun 09, 2014 2:49 am

Hi:

error happened when doing " C:\mingw64\bin\mingw32-make.exe test"

102/102 Test #102: example_DGELS_colmajor ........... Passed 0.02 sec

99% tests passed, 1 tests failed out of 102

Total Test time (real) = 11.05 sec

The following tests FAILED:
98 - LAPACK_Test_Summary (Not Run)
%1 is not a valid Win32 application
Problem running command: ./lapack_testing.py -s -d TESTING
Problem executing post-test command(s).
Errors while running CTest
Makefile:135: recipe for target 'test' failed
mingw32-make: *** [test] Error 8
wgf08062015
 
Posts: 1
Joined: Mon Jun 09, 2014 2:39 am

Re: error happened when did "C:\mingw64\bin\mingw32-make.exe

Postby admin » Mon Jun 09, 2014 3:12 pm

Hi,
I would not worry about it..
You can just try to run it by hand: ./lapack_testing.py -s -d TESTING
but otherwise, CTest give you the summary of test passing or failing.
admin
Site Admin
 
Posts: 616
Joined: Wed Dec 08, 2004 7:07 pm


Return to Windows

Who is online

Users browsing this forum: No registered users and 1 guest

cron