Page 1 of 1

error happened when did "C:\mingw64\bin\mingw32-make.exe tes

PostPosted: Mon Jun 09, 2014 2:49 am
by wgf08062015
Hi:

error happened when doing " C:\mingw64\bin\mingw32-make.exe test"

102/102 Test #102: example_DGELS_colmajor ........... Passed 0.02 sec

99% tests passed, 1 tests failed out of 102

Total Test time (real) = 11.05 sec

The following tests FAILED:
98 - LAPACK_Test_Summary (Not Run)
%1 is not a valid Win32 application
Problem running command: ./lapack_testing.py -s -d TESTING
Problem executing post-test command(s).
Errors while running CTest
Makefile:135: recipe for target 'test' failed
mingw32-make: *** [test] Error 8

Re: error happened when did "C:\mingw64\bin\mingw32-make.exe

PostPosted: Mon Jun 09, 2014 3:12 pm
by admin
Hi,
I would not worry about it..
You can just try to run it by hand: ./lapack_testing.py -s -d TESTING
but otherwise, CTest give you the summary of test passing or failing.