Lapack building error

Post here if you are having problem installing LAPACK on a Windows machine

Lapack building error

Postby xusunpku » Thu Mar 02, 2017 4:34 am

I was following the instructions on the link http://icl.cs.utk.edu/lapack-for-windows/lapack/. everything works fine until I typed
Code: Select all
C:/MinGW/bin/mingw32-make.exe
, and the following message occured:

Code: Select all
[ 38%] Building Fortran object Testing/MATGEN/CMakeFiles/tmglib.dir/zlahilb.f.obj
[ 38%] Linking Fortran shared library ..\..\bin\libtmglib.dll
CMakeFiles\tmglib.dir/objects.a(slatms.f.obj):slatms.f:(.text+0x8eb): undefined reference to `sscal_'
CMakeFiles\tmglib.dir/objects.a(slatms.f.obj):slatms.f:(.text+0xa6e): undefined reference to `scopy_'
CMakeFiles\tmglib.dir/objects.a(slatms.f.obj):slatms.f:(.text+0x1776): undefined reference to `scopy_'
CMakeFiles\tmglib.dir/objects.a(slatms.f.obj):slatms.f:(.text+0x18f5): undefined reference to `scopy_'
CMakeFiles\tmglib.dir/objects.a(slatms.f.obj):slatms.f:(.text+0x1fe8): undefined reference to `scopy_'
CMakeFiles\tmglib.dir/objects.a(slatme.f.obj):slatme.f:(.text+0x84d): undefined reference to `sscal_'
CMakeFiles\tmglib.dir/objects.a(slatme.f.obj):slatme.f:(.text+0x8f1): undefined reference to `scopy_'
CMakeFiles\tmglib.dir/objects.a(slatme.f.obj):slatme.f:(.text+0xb55): undefined reference to `scopy_'
CMakeFiles\tmglib.dir/objects.a(slatme.f.obj):slatme.f:(.text+0xc01): undefined reference to `sgemv_'
CMakeFiles\tmglib.dir/objects.a(slatme.f.obj):slatme.f:(.text+0xc5a): undefined reference to `sger_'
CMakeFiles\tmglib.dir/objects.a(slatme.f.obj):slatme.f:(.text+0xcbf): undefined reference to `sgemv_'
CMakeFiles\tmglib.dir/objects.a(slatme.f.obj):slatme.f:(.text+0xd1b): undefined reference to `sger_'
CMakeFiles\tmglib.dir/objects.a(slatme.f.obj):slatme.f:(.text+0xe87): undefined reference to `sscal_'
CMakeFiles\tmglib.dir/objects.a(slatme.f.obj):slatme.f:(.text+0x1041): undefined reference to `scopy_'
CMakeFiles\tmglib.dir/objects.a(slatme.f.obj):slatme.f:(.text+0x10e5): undefined reference to `sgemv_'
CMakeFiles\tmglib.dir/objects.a(slatme.f.obj):slatme.f:(.text+0x113b): undefined reference to `sger_'
CMakeFiles\tmglib.dir/objects.a(slatme.f.obj):slatme.f:(.text+0x1199): undefined reference to `sgemv_'
CMakeFiles\tmglib.dir/objects.a(slatme.f.obj):slatme.f:(.text+0x11f2): undefined reference to `sger_'
CMakeFiles\tmglib.dir/objects.a(slatme.f.obj):slatme.f:(.text+0x13e8): undefined reference to `sscal_'
CMakeFiles\tmglib.dir/objects.a(slatme.f.obj):slatme.f:(.text+0x1414): undefined reference to `sscal_'
CMakeFiles\tmglib.dir/objects.a(slatmr.f.obj):slatmr.f:(.text+0x1442): undefined reference to `sscal_'
CMakeFiles\tmglib.dir/objects.a(slatmr.f.obj):slatmr.f:(.text+0x1473): undefined reference to `sscal_'
CMakeFiles\tmglib.dir/objects.a(slatmr.f.obj):slatmr.f:(.text+0x1708): undefined reference to `sscal_'
CMakeFiles\tmglib.dir/objects.a(slatmr.f.obj):slatmr.f:(.text+0x1c96): more undefined references to `sscal_' follow
CMakeFiles\tmglib.dir/objects.a(slatmt.f.obj):slatmt.f:(.text+0xa82): undefined reference to `scopy_'
CMakeFiles\tmglib.dir/objects.a(slatmt.f.obj):slatmt.f:(.text+0x1796): undefined reference to `scopy_'
CMakeFiles\tmglib.dir/objects.a(slatmt.f.obj):slatmt.f:(.text+0x1915): undefined reference to `scopy_'
CMakeFiles\tmglib.dir/objects.a(slatmt.f.obj):slatmt.f:(.text+0x2018): undefined reference to `scopy_'
CMakeFiles\tmglib.dir/objects.a(slagge.f.obj):slagge.f:(.text+0x226): undefined reference to `snrm2_'
CMakeFiles\tmglib.dir/objects.a(slagge.f.obj):slagge.f:(.text+0x2db): undefined reference to `sgemv_'
CMakeFiles\tmglib.dir/objects.a(slagge.f.obj):slagge.f:(.text+0x34c): undefined reference to `sger_'
CMakeFiles\tmglib.dir/objects.a(slagge.f.obj):slagge.f:(.text+0x39d): undefined reference to `snrm2_'
CMakeFiles\tmglib.dir/objects.a(slagge.f.obj):slagge.f:(.text+0x456): undefined reference to `sgemv_'
CMakeFiles\tmglib.dir/objects.a(slagge.f.obj):slagge.f:(.text+0x4cb): undefined reference to `sger_'
CMakeFiles\tmglib.dir/objects.a(slagge.f.obj):slagge.f:(.text+0x706): undefined reference to `snrm2_'
CMakeFiles\tmglib.dir/objects.a(slagge.f.obj):slagge.f:(.text+0x7e9): undefined reference to `sgemv_'
CMakeFiles\tmglib.dir/objects.a(slagge.f.obj):slagge.f:(.text+0x87e): undefined reference to `sger_'
CMakeFiles\tmglib.dir/objects.a(slagge.f.obj):slagge.f:(.text+0x8e5): undefined reference to `snrm2_'
CMakeFiles\tmglib.dir/objects.a(slagge.f.obj):slagge.f:(.text+0x9d3): undefined reference to `sgemv_'
CMakeFiles\tmglib.dir/objects.a(slagge.f.obj):slagge.f:(.text+0xa6a): undefined reference to `sger_'
CMakeFiles\tmglib.dir/objects.a(slagge.f.obj):slagge.f:(.text+0xae7): undefined reference to `snrm2_'
CMakeFiles\tmglib.dir/objects.a(slagge.f.obj):slagge.f:(.text+0xbd5): undefined reference to `sgemv_'
CMakeFiles\tmglib.dir/objects.a(slagge.f.obj):slagge.f:(.text+0xc6c): undefined reference to `sger_'
CMakeFiles\tmglib.dir/objects.a(slagge.f.obj):slagge.f:(.text+0xcc0): undefined reference to `snrm2_'
CMakeFiles\tmglib.dir/objects.a(slagge.f.obj):slagge.f:(.text+0xda3): undefined reference to `sgemv_'
CMakeFiles\tmglib.dir/objects.a(slagge.f.obj):slagge.f:(.text+0xe38): undefined reference to `sger_'
CMakeFiles\tmglib.dir/objects.a(slagge.f.obj):slagge.f:(.text+0xeba): undefined reference to `sscal_'
CMakeFiles\tmglib.dir/objects.a(slagge.f.obj):slagge.f:(.text+0xf25): undefined reference to `sscal_'
CMakeFiles\tmglib.dir/objects.a(slagge.f.obj):slagge.f:(.text+0xf9c): undefined reference to `sscal_'
CMakeFiles\tmglib.dir/objects.a(slagge.f.obj):slagge.f:(.text+0x1028): undefined reference to `sscal_'
CMakeFiles\tmglib.dir/objects.a(slagge.f.obj):slagge.f:(.text+0x10bd): undefined reference to `sscal_'
CMakeFiles\tmglib.dir/objects.a(slagge.f.obj):slagge.f:(.text+0x1158): more undefined references to `sscal_' follow
CMakeFiles\tmglib.dir/objects.a(slagsy.f.obj):slagsy.f:(.text+0x1ce): undefined reference to `ssymv_'
CMakeFiles\tmglib.dir/objects.a(slagsy.f.obj):slagsy.f:(.text+0x215): undefined reference to `sdot_'
CMakeFiles\tmglib.dir/objects.a(slagsy.f.obj):slagsy.f:(.text+0x25d): undefined reference to `saxpy_'
CMakeFiles\tmglib.dir/objects.a(slagsy.f.obj):slagsy.f:(.text+0x2be): undefined reference to `ssyr2_'
CMakeFiles\tmglib.dir/objects.a(slagsy.f.obj):slagsy.f:(.text+0x31e): undefined reference to `snrm2_'
CMakeFiles\tmglib.dir/objects.a(slagsy.f.obj):slagsy.f:(.text+0x397): undefined reference to `sscal_'
CMakeFiles\tmglib.dir/objects.a(slagsy.f.obj):slagsy.f:(.text+0x4c1): undefined reference to `snrm2_'
CMakeFiles\tmglib.dir/objects.a(slagsy.f.obj):slagsy.f:(.text+0x5a5): undefined reference to `sgemv_'
CMakeFiles\tmglib.dir/objects.a(slagsy.f.obj):slagsy.f:(.text+0x636): undefined reference to `sger_'
CMakeFiles\tmglib.dir/objects.a(slagsy.f.obj):slagsy.f:(.text+0x6c1): undefined reference to `ssymv_'
CMakeFiles\tmglib.dir/objects.a(slagsy.f.obj):slagsy.f:(.text+0x719): undefined reference to `sdot_'
CMakeFiles\tmglib.dir/objects.a(slagsy.f.obj):slagsy.f:(.text+0x772): undefined reference to `saxpy_'
CMakeFiles\tmglib.dir/objects.a(slagsy.f.obj):slagsy.f:(.text+0x7f0): undefined reference to `ssyr2_'
CMakeFiles\tmglib.dir/objects.a(slagsy.f.obj):slagsy.f:(.text+0x8b8): undefined reference to `sscal_'
CMakeFiles\tmglib.dir/objects.a(slarge.f.obj):slarge.f:(.text+0x108): undefined reference to `sgemv_'
CMakeFiles\tmglib.dir/objects.a(slarge.f.obj):slarge.f:(.text+0x162): undefined reference to `sger_'
CMakeFiles\tmglib.dir/objects.a(slarge.f.obj):slarge.f:(.text+0x1cc): undefined reference to `sgemv_'
CMakeFiles\tmglib.dir/objects.a(slarge.f.obj):slarge.f:(.text+0x224): undefined reference to `sger_'
CMakeFiles\tmglib.dir/objects.a(slarge.f.obj):slarge.f:(.text+0x299): undefined reference to `snrm2_'
CMakeFiles\tmglib.dir/objects.a(slarge.f.obj):slarge.f:(.text+0x30a): undefined reference to `sscal_'
CMakeFiles\tmglib.dir/objects.a(slaror.f.obj):slaror.f:(.text+0x25a): undefined reference to `snrm2_'
CMakeFiles\tmglib.dir/objects.a(slaror.f.obj):slaror.f:(.text+0x3a0): undefined reference to `sscal_'
CMakeFiles\tmglib.dir/objects.a(slaror.f.obj):slaror.f:(.text+0x41a): undefined reference to `sscal_'
CMakeFiles\tmglib.dir/objects.a(slaror.f.obj):slaror.f:(.text+0x4a4): undefined reference to `sgemv_'
CMakeFiles\tmglib.dir/objects.a(slaror.f.obj):slaror.f:(.text+0x4fc): undefined reference to `sger_'
CMakeFiles\tmglib.dir/objects.a(slaror.f.obj):slaror.f:(.text+0x59d): undefined reference to `sgemv_'
CMakeFiles\tmglib.dir/objects.a(slaror.f.obj):slaror.f:(.text+0x5f9): undefined reference to `sger_'
CMakeFiles\tmglib.dir/objects.a(slarot.f.obj):slarot.f:(.text+0xee): undefined reference to `srot_'
CMakeFiles\tmglib.dir/objects.a(slarot.f.obj):slarot.f:(.text+0x130): undefined reference to `srot_'
CMakeFiles\tmglib.dir/objects.a(slatm5.f.obj):slatm5.f:(.text+0x4d9): undefined reference to `sgemm_'
CMakeFiles\tmglib.dir/objects.a(slatm5.f.obj):slatm5.f:(.text+0x54d): undefined reference to `sgemm_'
CMakeFiles\tmglib.dir/objects.a(slatm5.f.obj):slatm5.f:(.text+0x5cc): undefined reference to `sgemm_'
CMakeFiles\tmglib.dir/objects.a(slatm5.f.obj):slatm5.f:(.text+0x678): undefined reference to `sgemm_'
CMakeFiles\tmglib.dir/objects.a(dlatms.f.obj):dlatms.f:(.text+0x8fb): undefined reference to `dscal_'
CMakeFiles\tmglib.dir/objects.a(dlatms.f.obj):dlatms.f:(.text+0xa7e): undefined reference to `dcopy_'
CMakeFiles\tmglib.dir/objects.a(dlatms.f.obj):dlatms.f:(.text+0x1786): undefined reference to `dcopy_'
CMakeFiles\tmglib.dir/objects.a(dlatms.f.obj):dlatms.f:(.text+0x190e): undefined reference to `dcopy_'
CMakeFiles\tmglib.dir/objects.a(dlatms.f.obj):dlatms.f:(.text+0x2038): undefined reference to `dcopy_'
CMakeFiles\tmglib.dir/objects.a(dlatme.f.obj):dlatme.f:(.text+0x857): undefined reference to `dscal_'
CMakeFiles\tmglib.dir/objects.a(dlatme.f.obj):dlatme.f:(.text+0x8fb): undefined reference to `dcopy_'
CMakeFiles\tmglib.dir/objects.a(dlatme.f.obj):dlatme.f:(.text+0xb69): undefined reference to `dcopy_'
CMakeFiles\tmglib.dir/objects.a(dlatme.f.obj):dlatme.f:(.text+0xc16): undefined reference to `dgemv_'
CMakeFiles\tmglib.dir/objects.a(dlatme.f.obj):dlatme.f:(.text+0xc72): undefined reference to `dger_'
CMakeFiles\tmglib.dir/objects.a(dlatme.f.obj):dlatme.f:(.text+0xcda): undefined reference to `dgemv_'
CMakeFiles\tmglib.dir/objects.a(dlatme.f.obj):dlatme.f:(.text+0xd39): undefined reference to `dger_'
CMakeFiles\tmglib.dir/objects.a(dlatme.f.obj):dlatme.f:(.text+0xea8): undefined reference to `dscal_'
CMakeFiles\tmglib.dir/objects.a(dlatme.f.obj):dlatme.f:(.text+0x1071): undefined reference to `dcopy_'
CMakeFiles\tmglib.dir/objects.a(dlatme.f.obj):dlatme.f:(.text+0x1113): undefined reference to `dgemv_'
CMakeFiles\tmglib.dir/objects.a(dlatme.f.obj):dlatme.f:(.text+0x1169): undefined reference to `dger_'
CMakeFiles\tmglib.dir/objects.a(dlatme.f.obj):dlatme.f:(.text+0x11c7): undefined reference to `dgemv_'
CMakeFiles\tmglib.dir/objects.a(dlatme.f.obj):dlatme.f:(.text+0x1220): undefined reference to `dger_'
CMakeFiles\tmglib.dir/objects.a(dlatme.f.obj):dlatme.f:(.text+0x141a): undefined reference to `dscal_'
CMakeFiles\tmglib.dir/objects.a(dlatme.f.obj):dlatme.f:(.text+0x1446): undefined reference to `dscal_'
CMakeFiles\tmglib.dir/objects.a(dlatmr.f.obj):dlatmr.f:(.text+0x1422): undefined reference to `dscal_'
CMakeFiles\tmglib.dir/objects.a(dlatmr.f.obj):dlatmr.f:(.text+0x1453): undefined reference to `dscal_'
CMakeFiles\tmglib.dir/objects.a(dlatmr.f.obj):dlatmr.f:(.text+0x16e8): undefined reference to `dscal_'
CMakeFiles\tmglib.dir/objects.a(dlatmr.f.obj):dlatmr.f:(.text+0x1c66): more undefined references to `dscal_' follow
CMakeFiles\tmglib.dir/objects.a(dlatmt.f.obj):dlatmt.f:(.text+0xa92): undefined reference to `dcopy_'
CMakeFiles\tmglib.dir/objects.a(dlatmt.f.obj):dlatmt.f:(.text+0x1796): undefined reference to `dcopy_'
CMakeFiles\tmglib.dir/objects.a(dlatmt.f.obj):dlatmt.f:(.text+0x191e): undefined reference to `dcopy_'
CMakeFiles\tmglib.dir/objects.a(dlatmt.f.obj):dlatmt.f:(.text+0x2048): undefined reference to `dcopy_'
CMakeFiles\tmglib.dir/objects.a(dlagge.f.obj):dlagge.f:(.text+0x217): undefined reference to `dnrm2_'
CMakeFiles\tmglib.dir/objects.a(dlagge.f.obj):dlagge.f:(.text+0x2cd): undefined reference to `dgemv_'
CMakeFiles\tmglib.dir/objects.a(dlagge.f.obj):dlagge.f:(.text+0x33f): undefined reference to `dger_'
CMakeFiles\tmglib.dir/objects.a(dlagge.f.obj):dlagge.f:(.text+0x392): undefined reference to `dnrm2_'
CMakeFiles\tmglib.dir/objects.a(dlagge.f.obj):dlagge.f:(.text+0x44c): undefined reference to `dgemv_'
CMakeFiles\tmglib.dir/objects.a(dlagge.f.obj):dlagge.f:(.text+0x4c2): undefined reference to `dger_'
CMakeFiles\tmglib.dir/objects.a(dlagge.f.obj):dlagge.f:(.text+0x6f6): undefined reference to `dnrm2_'
CMakeFiles\tmglib.dir/objects.a(dlagge.f.obj):dlagge.f:(.text+0x7d8): undefined reference to `dgemv_'
CMakeFiles\tmglib.dir/objects.a(dlagge.f.obj):dlagge.f:(.text+0x86e): undefined reference to `dger_'
CMakeFiles\tmglib.dir/objects.a(dlagge.f.obj):dlagge.f:(.text+0x8d2): undefined reference to `dnrm2_'
CMakeFiles\tmglib.dir/objects.a(dlagge.f.obj):dlagge.f:(.text+0x9c7): undefined reference to `dgemv_'
CMakeFiles\tmglib.dir/objects.a(dlagge.f.obj):dlagge.f:(.text+0xa62): undefined reference to `dger_'
CMakeFiles\tmglib.dir/objects.a(dlagge.f.obj):dlagge.f:(.text+0xae2): undefined reference to `dnrm2_'
CMakeFiles\tmglib.dir/objects.a(dlagge.f.obj):dlagge.f:(.text+0xbd7): undefined reference to `dgemv_'
CMakeFiles\tmglib.dir/objects.a(dlagge.f.obj):dlagge.f:(.text+0xc72): undefined reference to `dger_'
CMakeFiles\tmglib.dir/objects.a(dlagge.f.obj):dlagge.f:(.text+0xcc4): undefined reference to `dnrm2_'
CMakeFiles\tmglib.dir/objects.a(dlagge.f.obj):dlagge.f:(.text+0xda6): undefined reference to `dgemv_'
CMakeFiles\tmglib.dir/objects.a(dlagge.f.obj):dlagge.f:(.text+0xe3c): undefined reference to `dger_'
CMakeFiles\tmglib.dir/objects.a(dlagge.f.obj):dlagge.f:(.text+0xeb7): undefined reference to `dscal_'
CMakeFiles\tmglib.dir/objects.a(dlagge.f.obj):dlagge.f:(.text+0xf1e): undefined reference to `dscal_'
CMakeFiles\tmglib.dir/objects.a(dlagge.f.obj):dlagge.f:(.text+0xf93): undefined reference to `dscal_'
CMakeFiles\tmglib.dir/objects.a(dlagge.f.obj):dlagge.f:(.text+0x1016): undefined reference to `dscal_'
CMakeFiles\tmglib.dir/objects.a(dlagge.f.obj):dlagge.f:(.text+0x10a2): undefined reference to `dscal_'
CMakeFiles\tmglib.dir/objects.a(dlagge.f.obj):dlagge.f:(.text+0x1137): more undefined references to `dscal_' follow
CMakeFiles\tmglib.dir/objects.a(dlagsy.f.obj):dlagsy.f:(.text+0x1ce): undefined reference to `dsymv_'
CMakeFiles\tmglib.dir/objects.a(dlagsy.f.obj):dlagsy.f:(.text+0x215): undefined reference to `ddot_'
CMakeFiles\tmglib.dir/objects.a(dlagsy.f.obj):dlagsy.f:(.text+0x260): undefined reference to `daxpy_'
CMakeFiles\tmglib.dir/objects.a(dlagsy.f.obj):dlagsy.f:(.text+0x2c1): undefined reference to `dsyr2_'
CMakeFiles\tmglib.dir/objects.a(dlagsy.f.obj):dlagsy.f:(.text+0x321): undefined reference to `dnrm2_'
CMakeFiles\tmglib.dir/objects.a(dlagsy.f.obj):dlagsy.f:(.text+0x3a5): undefined reference to `dscal_'
CMakeFiles\tmglib.dir/objects.a(dlagsy.f.obj):dlagsy.f:(.text+0x4d1): undefined reference to `dnrm2_'
CMakeFiles\tmglib.dir/objects.a(dlagsy.f.obj):dlagsy.f:(.text+0x5b9): undefined reference to `dgemv_'
CMakeFiles\tmglib.dir/objects.a(dlagsy.f.obj):dlagsy.f:(.text+0x64a): undefined reference to `dger_'
CMakeFiles\tmglib.dir/objects.a(dlagsy.f.obj):dlagsy.f:(.text+0x6d5): undefined reference to `dsymv_'
CMakeFiles\tmglib.dir/objects.a(dlagsy.f.obj):dlagsy.f:(.text+0x72d): undefined reference to `ddot_'
CMakeFiles\tmglib.dir/objects.a(dlagsy.f.obj):dlagsy.f:(.text+0x789): undefined reference to `daxpy_'
CMakeFiles\tmglib.dir/objects.a(dlagsy.f.obj):dlagsy.f:(.text+0x807): undefined reference to `dsyr2_'
CMakeFiles\tmglib.dir/objects.a(dlagsy.f.obj):dlagsy.f:(.text+0x8cb): undefined reference to `dscal_'
CMakeFiles\tmglib.dir/objects.a(dlarge.f.obj):dlarge.f:(.text+0x110): undefined reference to `dgemv_'
CMakeFiles\tmglib.dir/objects.a(dlarge.f.obj):dlarge.f:(.text+0x16a): undefined reference to `dger_'
CMakeFiles\tmglib.dir/objects.a(dlarge.f.obj):dlarge.f:(.text+0x1d4): undefined reference to `dgemv_'
CMakeFiles\tmglib.dir/objects.a(dlarge.f.obj):dlarge.f:(.text+0x22c): undefined reference to `dger_'
CMakeFiles\tmglib.dir/objects.a(dlarge.f.obj):dlarge.f:(.text+0x2a1): undefined reference to `dnrm2_'
CMakeFiles\tmglib.dir/objects.a(dlarge.f.obj):dlarge.f:(.text+0x308): undefined reference to `dscal_'
CMakeFiles\tmglib.dir/objects.a(dlaror.f.obj):dlaror.f:(.text+0x25a): undefined reference to `dnrm2_'
CMakeFiles\tmglib.dir/objects.a(dlaror.f.obj):dlaror.f:(.text+0x3a0): undefined reference to `dscal_'
CMakeFiles\tmglib.dir/objects.a(dlaror.f.obj):dlaror.f:(.text+0x41a): undefined reference to `dscal_'
CMakeFiles\tmglib.dir/objects.a(dlaror.f.obj):dlaror.f:(.text+0x4a4): undefined reference to `dgemv_'
CMakeFiles\tmglib.dir/objects.a(dlaror.f.obj):dlaror.f:(.text+0x4fc): undefined reference to `dger_'
CMakeFiles\tmglib.dir/objects.a(dlaror.f.obj):dlaror.f:(.text+0x59d): undefined reference to `dgemv_'
CMakeFiles\tmglib.dir/objects.a(dlaror.f.obj):dlaror.f:(.text+0x5f9): undefined reference to `dger_'
CMakeFiles\tmglib.dir/objects.a(dlarot.f.obj):dlarot.f:(.text+0xfd): undefined reference to `drot_'
CMakeFiles\tmglib.dir/objects.a(dlarot.f.obj):dlarot.f:(.text+0x13f): undefined reference to `drot_'
CMakeFiles\tmglib.dir/objects.a(dlatm5.f.obj):dlatm5.f:(.text+0x4f9): undefined reference to `dgemm_'
CMakeFiles\tmglib.dir/objects.a(dlatm5.f.obj):dlatm5.f:(.text+0x56d): undefined reference to `dgemm_'
CMakeFiles\tmglib.dir/objects.a(dlatm5.f.obj):dlatm5.f:(.text+0x5ef): undefined reference to `dgemm_'
CMakeFiles\tmglib.dir/objects.a(dlatm5.f.obj):dlatm5.f:(.text+0x69b): undefined reference to `dgemm_'
CMakeFiles\tmglib.dir/objects.a(clatms.f.obj):clatms.f:(.text+0x90a): undefined reference to `sscal_'
CMakeFiles\tmglib.dir/objects.a(clatme.f.obj):clatme.f:(.text+0x7a7): undefined reference to `cscal_'
CMakeFiles\tmglib.dir/objects.a(clatme.f.obj):clatme.f:(.text+0x852): undefined reference to `ccopy_'
CMakeFiles\tmglib.dir/objects.a(clatme.f.obj):clatme.f:(.text+0xa1d): undefined reference to `ccopy_'
CMakeFiles\tmglib.dir/objects.a(clatme.f.obj):clatme.f:(.text+0xb35): undefined reference to `cgemv_'
CMakeFiles\tmglib.dir/objects.a(clatme.f.obj):clatme.f:(.text+0xb9e): undefined reference to `cgerc_'
CMakeFiles\tmglib.dir/objects.a(clatme.f.obj):clatme.f:(.text+0xc06): undefined reference to `cgemv_'
CMakeFiles\tmglib.dir/objects.a(clatme.f.obj):clatme.f:(.text+0xc70): undefined reference to `cgerc_'
CMakeFiles\tmglib.dir/objects.a(clatme.f.obj):clatme.f:(.text+0xd20): undefined reference to `cscal_'
CMakeFiles\tmglib.dir/objects.a(clatme.f.obj):clatme.f:(.text+0xd61): undefined reference to `cscal_'
CMakeFiles\tmglib.dir/objects.a(clatme.f.obj):clatme.f:(.text+0xe57): undefined reference to `csscal_'
CMakeFiles\tmglib.dir/objects.a(clatme.f.obj):clatme.f:(.text+0xfb8): undefined reference to `ccopy_'
CMakeFiles\tmglib.dir/objects.a(clatme.f.obj):clatme.f:(.text+0x10ea): undefined reference to `cgemv_'
CMakeFiles\tmglib.dir/objects.a(clatme.f.obj):clatme.f:(.text+0x114c): undefined reference to `cgerc_'
CMakeFiles\tmglib.dir/objects.a(clatme.f.obj):clatme.f:(.text+0x11ad): undefined reference to `cgemv_'
CMakeFiles\tmglib.dir/objects.a(clatme.f.obj):clatme.f:(.text+0x1210): undefined reference to `cgerc_'
CMakeFiles\tmglib.dir/objects.a(clatme.f.obj):clatme.f:(.text+0x12c6): undefined reference to `cscal_'
CMakeFiles\tmglib.dir/objects.a(clatme.f.obj):clatme.f:(.text+0x1303): undefined reference to `cscal_'
CMakeFiles\tmglib.dir/objects.a(clatme.f.obj):clatme.f:(.text+0x1480): undefined reference to `csscal_'
CMakeFiles\tmglib.dir/objects.a(clatme.f.obj):clatme.f:(.text+0x14b5): undefined reference to `csscal_'
CMakeFiles\tmglib.dir/objects.a(clatmr.f.obj):clatmr.f:(.text+0x15ce): undefined reference to `csscal_'
CMakeFiles\tmglib.dir/objects.a(clatmr.f.obj):clatmr.f:(.text+0x15ff): undefined reference to `csscal_'
CMakeFiles\tmglib.dir/objects.a(clatmr.f.obj):clatmr.f:(.text+0x18a8): undefined reference to `csscal_'
CMakeFiles\tmglib.dir/objects.a(clatmr.f.obj):clatmr.f:(.text+0x1f22): more undefined references to `csscal_' follow
CMakeFiles\tmglib.dir/objects.a(clatmt.f.obj):clatmt.f:(.text+0x931): undefined reference to `sscal_'
CMakeFiles\tmglib.dir/objects.a(clagge.f.obj):clagge.f:(.text+0x21b): undefined reference to `scnrm2_'
CMakeFiles\tmglib.dir/objects.a(clagge.f.obj):clagge.f:(.text+0x2ec): undefined reference to `cgemv_'
CMakeFiles\tmglib.dir/objects.a(clagge.f.obj):clagge.f:(.text+0x365): undefined reference to `cgerc_'
CMakeFiles\tmglib.dir/objects.a(clagge.f.obj):clagge.f:(.text+0x3b6): undefined reference to `scnrm2_'
CMakeFiles\tmglib.dir/objects.a(clagge.f.obj):clagge.f:(.text+0x48b): undefined reference to `cgemv_'
CMakeFiles\tmglib.dir/objects.a(clagge.f.obj):clagge.f:(.text+0x508): undefined reference to `cgerc_'
CMakeFiles\tmglib.dir/objects.a(clagge.f.obj):clagge.f:(.text+0x772): undefined reference to `scnrm2_'
CMakeFiles\tmglib.dir/objects.a(clagge.f.obj):clagge.f:(.text+0x8ac): undefined reference to `cgemv_'
CMakeFiles\tmglib.dir/objects.a(clagge.f.obj):clagge.f:(.text+0x956): undefined reference to `cgerc_'
CMakeFiles\tmglib.dir/objects.a(clagge.f.obj):clagge.f:(.text+0x9db): undefined reference to `scnrm2_'
CMakeFiles\tmglib.dir/objects.a(clagge.f.obj):clagge.f:(.text+0xb71): undefined reference to `cgemv_'
CMakeFiles\tmglib.dir/objects.a(clagge.f.obj):clagge.f:(.text+0xc1a): undefined reference to `cgerc_'
CMakeFiles\tmglib.dir/objects.a(clagge.f.obj):clagge.f:(.text+0xcab): undefined reference to `scnrm2_'
CMakeFiles\tmglib.dir/objects.a(clagge.f.obj):clagge.f:(.text+0xe41): undefined reference to `cgemv_'
CMakeFiles\tmglib.dir/objects.a(clagge.f.obj):clagge.f:(.text+0xeea): undefined reference to `cgerc_'
CMakeFiles\tmglib.dir/objects.a(clagge.f.obj):clagge.f:(.text+0xf42): undefined reference to `scnrm2_'
CMakeFiles\tmglib.dir/objects.a(clagge.f.obj):clagge.f:(.text+0x107c): undefined reference to `cgemv_'
CMakeFiles\tmglib.dir/objects.a(clagge.f.obj):clagge.f:(.text+0x1126): undefined reference to `cgerc_'
CMakeFiles\tmglib.dir/objects.a(clagge.f.obj):clagge.f:(.text+0x121c): undefined reference to `cscal_'
CMakeFiles\tmglib.dir/objects.a(clagge.f.obj):clagge.f:(.text+0x1325): undefined reference to `cscal_'
CMakeFiles\tmglib.dir/objects.a(clagge.f.obj):clagge.f:(.text+0x141c): undefined reference to `cscal_'
CMakeFiles\tmglib.dir/objects.a(clagge.f.obj):clagge.f:(.text+0x152c): undefined reference to `cscal_'
CMakeFiles\tmglib.dir/objects.a(clagge.f.obj):clagge.f:(.text+0x1643): undefined reference to `cscal_'
CMakeFiles\tmglib.dir/objects.a(clagge.f.obj):clagge.f:(.text+0x1763): more undefined references to `cscal_' follow
CMakeFiles\tmglib.dir/objects.a(claghe.f.obj):claghe.f:(.text+0x214): undefined reference to `chemv_'
CMakeFiles\tmglib.dir/objects.a(claghe.f.obj):claghe.f:(.text+0x279): undefined reference to `cdotc_'
CMakeFiles\tmglib.dir/objects.a(claghe.f.obj):claghe.f:(.text+0x2f6): undefined reference to `caxpy_'
CMakeFiles\tmglib.dir/objects.a(claghe.f.obj):claghe.f:(.text+0x356): undefined reference to `cher2_'
CMakeFiles\tmglib.dir/objects.a(claghe.f.obj):claghe.f:(.text+0x3b6): undefined reference to `scnrm2_'
CMakeFiles\tmglib.dir/objects.a(claghe.f.obj):claghe.f:(.text+0x4a3): undefined reference to `cscal_'
CMakeFiles\tmglib.dir/objects.a(claghe.f.obj):claghe.f:(.text+0x617): undefined reference to `scnrm2_'
CMakeFiles\tmglib.dir/objects.a(claghe.f.obj):claghe.f:(.text+0x761): undefined reference to `cgemv_'
CMakeFiles\tmglib.dir/objects.a(claghe.f.obj):claghe.f:(.text+0x802): undefined reference to `cgerc_'
CMakeFiles\tmglib.dir/objects.a(claghe.f.obj):claghe.f:(.text+0x88e): undefined reference to `chemv_'
CMakeFiles\tmglib.dir/objects.a(claghe.f.obj):claghe.f:(.text+0x905): undefined reference to `cdotc_'
CMakeFiles\tmglib.dir/objects.a(claghe.f.obj):claghe.f:(.text+0x994): undefined reference to `caxpy_'
CMakeFiles\tmglib.dir/objects.a(claghe.f.obj):claghe.f:(.text+0xa13): undefined reference to `cher2_'
CMakeFiles\tmglib.dir/objects.a(claghe.f.obj):claghe.f:(.text+0xb3f): undefined reference to `cscal_'
CMakeFiles\tmglib.dir/objects.a(clagsy.f.obj):clagsy.f:(.text+0x1cf): undefined reference to `scnrm2_'
CMakeFiles\tmglib.dir/objects.a(clagsy.f.obj):clagsy.f:(.text+0x344): undefined reference to `cdotc_'
CMakeFiles\tmglib.dir/objects.a(clagsy.f.obj):clagsy.f:(.text+0x3bb): undefined reference to `caxpy_'
CMakeFiles\tmglib.dir/objects.a(clagsy.f.obj):clagsy.f:(.text+0x505): undefined reference to `scnrm2_'
CMakeFiles\tmglib.dir/objects.a(clagsy.f.obj):clagsy.f:(.text+0x63c): undefined reference to `cgemv_'
CMakeFiles\tmglib.dir/objects.a(clagsy.f.obj):clagsy.f:(.text+0x6dd): undefined reference to `cgerc_'
CMakeFiles\tmglib.dir/objects.a(clagsy.f.obj):clagsy.f:(.text+0x841): undefined reference to `cdotc_'
CMakeFiles\tmglib.dir/objects.a(clagsy.f.obj):clagsy.f:(.text+0x8cf): undefined reference to `caxpy_'
CMakeFiles\tmglib.dir/objects.a(clagsy.f.obj):clagsy.f:(.text+0xbc8): undefined reference to `cscal_'
CMakeFiles\tmglib.dir/objects.a(clagsy.f.obj):clagsy.f:(.text+0xcee): undefined reference to `cscal_'
CMakeFiles\tmglib.dir/objects.a(clarge.f.obj):clarge.f:(.text+0x10c): undefined reference to `cgemv_'
CMakeFiles\tmglib.dir/objects.a(clarge.f.obj):clarge.f:(.text+0x16e): undefined reference to `cgerc_'
CMakeFiles\tmglib.dir/objects.a(clarge.f.obj):clarge.f:(.text+0x1d8): undefined reference to `cgemv_'
CMakeFiles\tmglib.dir/objects.a(clarge.f.obj):clarge.f:(.text+0x238): undefined reference to `cgerc_'
CMakeFiles\tmglib.dir/objects.a(clarge.f.obj):clarge.f:(.text+0x2ad): undefined reference to `scnrm2_'
CMakeFiles\tmglib.dir/objects.a(clarge.f.obj):clarge.f:(.text+0x39a): undefined reference to `cscal_'
CMakeFiles\tmglib.dir/objects.a(claror.f.obj):claror.f:(.text+0x2e6): undefined reference to `scnrm2_'
CMakeFiles\tmglib.dir/objects.a(claror.f.obj):claror.f:(.text+0x463): undefined reference to `cgemv_'
CMakeFiles\tmglib.dir/objects.a(claror.f.obj):claror.f:(.text+0x4bb): undefined reference to `cgerc_'
CMakeFiles\tmglib.dir/objects.a(claror.f.obj):claror.f:(.text+0x551): undefined reference to `cgemv_'
CMakeFiles\tmglib.dir/objects.a(claror.f.obj):claror.f:(.text+0x5ad): undefined reference to `cgerc_'
CMakeFiles\tmglib.dir/objects.a(claror.f.obj):claror.f:(.text+0x701): undefined reference to `cscal_'
CMakeFiles\tmglib.dir/objects.a(claror.f.obj):claror.f:(.text+0x807): undefined reference to `cscal_'
CMakeFiles\tmglib.dir/objects.a(claror.f.obj):claror.f:(.text+0x942): undefined reference to `cscal_'
CMakeFiles\tmglib.dir/objects.a(clatm5.f.obj):clatm5.f:(.text+0x66b): undefined reference to `cgemm_'
CMakeFiles\tmglib.dir/objects.a(clatm5.f.obj):clatm5.f:(.text+0x6df): undefined reference to `cgemm_'
CMakeFiles\tmglib.dir/objects.a(clatm5.f.obj):clatm5.f:(.text+0x765): undefined reference to `cgemm_'
CMakeFiles\tmglib.dir/objects.a(clatm5.f.obj):clatm5.f:(.text+0x811): undefined reference to `cgemm_'
CMakeFiles\tmglib.dir/objects.a(zlatms.f.obj):zlatms.f:(.text+0x8fa): undefined reference to `dscal_'
CMakeFiles\tmglib.dir/objects.a(zlatme.f.obj):zlatme.f:(.text+0x760): undefined reference to `zscal_'
CMakeFiles\tmglib.dir/objects.a(zlatme.f.obj):zlatme.f:(.text+0x80f): undefined reference to `zcopy_'
CMakeFiles\tmglib.dir/objects.a(zlatme.f.obj):zlatme.f:(.text+0x9dd): undefined reference to `zcopy_'
CMakeFiles\tmglib.dir/objects.a(zlatme.f.obj):zlatme.f:(.text+0xaf2): undefined reference to `zgemv_'
CMakeFiles\tmglib.dir/objects.a(zlatme.f.obj):zlatme.f:(.text+0xb5f): undefined reference to `zgerc_'
CMakeFiles\tmglib.dir/objects.a(zlatme.f.obj):zlatme.f:(.text+0xbc9): undefined reference to `zgemv_'
CMakeFiles\tmglib.dir/objects.a(zlatme.f.obj):zlatme.f:(.text+0xc35): undefined reference to `zgerc_'
CMakeFiles\tmglib.dir/objects.a(zlatme.f.obj):zlatme.f:(.text+0xce1): undefined reference to `zscal_'
CMakeFiles\tmglib.dir/objects.a(zlatme.f.obj):zlatme.f:(.text+0xd22): undefined reference to `zscal_'
CMakeFiles\tmglib.dir/objects.a(zlatme.f.obj):zlatme.f:(.text+0xe17): undefined reference to `zdscal_'
CMakeFiles\tmglib.dir/objects.a(zlatme.f.obj):zlatme.f:(.text+0xf75): undefined reference to `zcopy_'
CMakeFiles\tmglib.dir/objects.a(zlatme.f.obj):zlatme.f:(.text+0x10a7): undefined reference to `zgemv_'
CMakeFiles\tmglib.dir/objects.a(zlatme.f.obj):zlatme.f:(.text+0x110b): undefined reference to `zgerc_'
CMakeFiles\tmglib.dir/objects.a(zlatme.f.obj):zlatme.f:(.text+0x116e): undefined reference to `zgemv_'
CMakeFiles\tmglib.dir/objects.a(zlatme.f.obj):zlatme.f:(.text+0x11d3): undefined reference to `zgerc_'
CMakeFiles\tmglib.dir/objects.a(zlatme.f.obj):zlatme.f:(.text+0x1285): undefined reference to `zscal_'
CMakeFiles\tmglib.dir/objects.a(zlatme.f.obj):zlatme.f:(.text+0x12c2): undefined reference to `zscal_'
CMakeFiles\tmglib.dir/objects.a(zlatme.f.obj):zlatme.f:(.text+0x1440): undefined reference to `zdscal_'
CMakeFiles\tmglib.dir/objects.a(zlatme.f.obj):zlatme.f:(.text+0x1475): undefined reference to `zdscal_'
CMakeFiles\tmglib.dir/objects.a(zlatmr.f.obj):zlatmr.f:(.text+0x166f): undefined reference to `zdscal_'
CMakeFiles\tmglib.dir/objects.a(zlatmr.f.obj):zlatmr.f:(.text+0x16a1): undefined reference to `zdscal_'
CMakeFiles\tmglib.dir/objects.a(zlatmr.f.obj):zlatmr.f:(.text+0x196e): undefined reference to `zdscal_'
CMakeFiles\tmglib.dir/objects.a(zlatmr.f.obj):zlatmr.f:(.text+0x2076): more undefined references to `zdscal_' follow
CMakeFiles\tmglib.dir/objects.a(zlatmt.f.obj):zlatmt.f:(.text+0x921): undefined reference to `dscal_'
CMakeFiles\tmglib.dir/objects.a(zlagge.f.obj):zlagge.f:(.text+0x234): undefined reference to `dznrm2_'
CMakeFiles\tmglib.dir/objects.a(zlagge.f.obj):zlagge.f:(.text+0x311): undefined reference to `zgemv_'
CMakeFiles\tmglib.dir/objects.a(zlagge.f.obj):zlagge.f:(.text+0x39c): undefined reference to `zgerc_'
CMakeFiles\tmglib.dir/objects.a(zlagge.f.obj):zlagge.f:(.text+0x3fc): undefined reference to `dznrm2_'
CMakeFiles\tmglib.dir/objects.a(zlagge.f.obj):zlagge.f:(.text+0x4dd): undefined reference to `zgemv_'
CMakeFiles\tmglib.dir/objects.a(zlagge.f.obj):zlagge.f:(.text+0x56c): undefined reference to `zgerc_'
CMakeFiles\tmglib.dir/objects.a(zlagge.f.obj):zlagge.f:(.text+0x7ce): undefined reference to `dznrm2_'
CMakeFiles\tmglib.dir/objects.a(zlagge.f.obj):zlagge.f:(.text+0x911): undefined reference to `zgemv_'
CMakeFiles\tmglib.dir/objects.a(zlagge.f.obj):zlagge.f:(.text+0x9c3): undefined reference to `zgerc_'
CMakeFiles\tmglib.dir/objects.a(zlagge.f.obj):zlagge.f:(.text+0xa55): undefined reference to `dznrm2_'
CMakeFiles\tmglib.dir/objects.a(zlagge.f.obj):zlagge.f:(.text+0xbe8): undefined reference to `zgemv_'
CMakeFiles\tmglib.dir/objects.a(zlagge.f.obj):zlagge.f:(.text+0xc9b): undefined reference to `zgerc_'
CMakeFiles\tmglib.dir/objects.a(zlagge.f.obj):zlagge.f:(.text+0xd35): undefined reference to `dznrm2_'
CMakeFiles\tmglib.dir/objects.a(zlagge.f.obj):zlagge.f:(.text+0xec8): undefined reference to `zgemv_'
CMakeFiles\tmglib.dir/objects.a(zlagge.f.obj):zlagge.f:(.text+0xf7b): undefined reference to `zgerc_'
CMakeFiles\tmglib.dir/objects.a(zlagge.f.obj):zlagge.f:(.text+0xfdc): undefined reference to `dznrm2_'
CMakeFiles\tmglib.dir/objects.a(zlagge.f.obj):zlagge.f:(.text+0x111f): undefined reference to `zgemv_'
CMakeFiles\tmglib.dir/objects.a(zlagge.f.obj):zlagge.f:(.text+0x11d1): undefined reference to `zgerc_'
CMakeFiles\tmglib.dir/objects.a(zlagge.f.obj):zlagge.f:(.text+0x12cc): undefined reference to `zscal_'
CMakeFiles\tmglib.dir/objects.a(zlagge.f.obj):zlagge.f:(.text+0x13d4): undefined reference to `zscal_'
CMakeFiles\tmglib.dir/objects.a(zlagge.f.obj):zlagge.f:(.text+0x14d6): undefined reference to `zscal_'
CMakeFiles\tmglib.dir/objects.a(zlagge.f.obj):zlagge.f:(.text+0x15f6): undefined reference to `zscal_'
CMakeFiles\tmglib.dir/objects.a(zlagge.f.obj):zlagge.f:(.text+0x171d): undefined reference to `zscal_'
CMakeFiles\tmglib.dir/objects.a(zlagge.f.obj):zlagge.f:(.text+0x1842): more undefined references to `zscal_' follow
CMakeFiles\tmglib.dir/objects.a(zlaghe.f.obj):zlaghe.f:(.text+0x1e6): undefined reference to `zhemv_'
CMakeFiles\tmglib.dir/objects.a(zlaghe.f.obj):zlaghe.f:(.text+0x256): undefined reference to `zdotc_'
CMakeFiles\tmglib.dir/objects.a(zlaghe.f.obj):zlaghe.f:(.text+0x2d1): undefined reference to `zaxpy_'
CMakeFiles\tmglib.dir/objects.a(zlaghe.f.obj):zlaghe.f:(.text+0x331): undefined reference to `zher2_'
CMakeFiles\tmglib.dir/objects.a(zlaghe.f.obj):zlaghe.f:(.text+0x391): undefined reference to `dznrm2_'
CMakeFiles\tmglib.dir/objects.a(zlaghe.f.obj):zlaghe.f:(.text+0x482): undefined reference to `zscal_'
CMakeFiles\tmglib.dir/objects.a(zlaghe.f.obj):zlaghe.f:(.text+0x5f3): undefined reference to `dznrm2_'
CMakeFiles\tmglib.dir/objects.a(zlaghe.f.obj):zlaghe.f:(.text+0x749): undefined reference to `zgemv_'
CMakeFiles\tmglib.dir/objects.a(zlaghe.f.obj):zlaghe.f:(.text+0x7f5): undefined reference to `zgerc_'
CMakeFiles\tmglib.dir/objects.a(zlaghe.f.obj):zlaghe.f:(.text+0x889): undefined reference to `zhemv_'
CMakeFiles\tmglib.dir/objects.a(zlaghe.f.obj):zlaghe.f:(.text+0x90f): undefined reference to `zdotc_'
CMakeFiles\tmglib.dir/objects.a(zlaghe.f.obj):zlaghe.f:(.text+0x9a0): undefined reference to `zaxpy_'
CMakeFiles\tmglib.dir/objects.a(zlaghe.f.obj):zlaghe.f:(.text+0xa2f): undefined reference to `zher2_'
CMakeFiles\tmglib.dir/objects.a(zlaghe.f.obj):zlaghe.f:(.text+0xbf8): undefined reference to `zscal_'
CMakeFiles\tmglib.dir/objects.a(zlagsy.f.obj):zlagsy.f:(.text+0x1c3): undefined reference to `dznrm2_'
CMakeFiles\tmglib.dir/objects.a(zlagsy.f.obj):zlagsy.f:(.text+0x34b): undefined reference to `zdotc_'
CMakeFiles\tmglib.dir/objects.a(zlagsy.f.obj):zlagsy.f:(.text+0x3c3): undefined reference to `zaxpy_'
CMakeFiles\tmglib.dir/objects.a(zlagsy.f.obj):zlagsy.f:(.text+0x51e): undefined reference to `dznrm2_'
CMakeFiles\tmglib.dir/objects.a(zlagsy.f.obj):zlagsy.f:(.text+0x66b): undefined reference to `zgemv_'
CMakeFiles\tmglib.dir/objects.a(zlagsy.f.obj):zlagsy.f:(.text+0x716): undefined reference to `zgerc_'
CMakeFiles\tmglib.dir/objects.a(zlagsy.f.obj):zlagsy.f:(.text+0x8c1): undefined reference to `zdotc_'
CMakeFiles\tmglib.dir/objects.a(zlagsy.f.obj):zlagsy.f:(.text+0x959): undefined reference to `zaxpy_'
CMakeFiles\tmglib.dir/objects.a(zlagsy.f.obj):zlagsy.f:(.text+0xc78): undefined reference to `zscal_'
CMakeFiles\tmglib.dir/objects.a(zlagsy.f.obj):zlagsy.f:(.text+0xda9): undefined reference to `zscal_'
CMakeFiles\tmglib.dir/objects.a(zlarge.f.obj):zlarge.f:(.text+0x116): undefined reference to `zgemv_'
CMakeFiles\tmglib.dir/objects.a(zlarge.f.obj):zlarge.f:(.text+0x17c): undefined reference to `zgerc_'
CMakeFiles\tmglib.dir/objects.a(zlarge.f.obj):zlarge.f:(.text+0x1e6): undefined reference to `zgemv_'
CMakeFiles\tmglib.dir/objects.a(zlarge.f.obj):zlarge.f:(.text+0x248): undefined reference to `zgerc_'
CMakeFiles\tmglib.dir/objects.a(zlarge.f.obj):zlarge.f:(.text+0x2bd): undefined reference to `dznrm2_'
CMakeFiles\tmglib.dir/objects.a(zlarge.f.obj):zlarge.f:(.text+0x39c): undefined reference to `zscal_'
CMakeFiles\tmglib.dir/objects.a(zlaror.f.obj):zlaror.f:(.text+0x2ea): undefined reference to `dznrm2_'
CMakeFiles\tmglib.dir/objects.a(zlaror.f.obj):zlaror.f:(.text+0x474): undefined reference to `zgemv_'
CMakeFiles\tmglib.dir/objects.a(zlaror.f.obj):zlaror.f:(.text+0x4dc): undefined reference to `zgerc_'
CMakeFiles\tmglib.dir/objects.a(zlaror.f.obj):zlaror.f:(.text+0x571): undefined reference to `zgemv_'
CMakeFiles\tmglib.dir/objects.a(zlaror.f.obj):zlaror.f:(.text+0x5d9): undefined reference to `zgerc_'
CMakeFiles\tmglib.dir/objects.a(zlaror.f.obj):zlaror.f:(.text+0x747): undefined reference to `zscal_'
CMakeFiles\tmglib.dir/objects.a(zlaror.f.obj):zlaror.f:(.text+0x85f): undefined reference to `zscal_'
CMakeFiles\tmglib.dir/objects.a(zlaror.f.obj):zlaror.f:(.text+0x9a2): undefined reference to `zscal_'
CMakeFiles\tmglib.dir/objects.a(zlatm5.f.obj):zlatm5.f:(.text+0x84c): undefined reference to `zgemm_'
CMakeFiles\tmglib.dir/objects.a(zlatm5.f.obj):zlatm5.f:(.text+0x8c0): undefined reference to `zgemm_'
CMakeFiles\tmglib.dir/objects.a(zlatm5.f.obj):zlatm5.f:(.text+0x942): undefined reference to `zgemm_'
CMakeFiles\tmglib.dir/objects.a(zlatm5.f.obj):zlatm5.f:(.text+0x9ee): undefined reference to `zgemm_'
collect2.exe: error: ld returned 1 exit status
Testing\MATGEN\CMakeFiles\tmglib.dir\build.make:1994: recipe for target 'bin/libtmglib.dll' failed
mingw32-make[2]: *** [bin/libtmglib.dll] Error 1
CMakeFiles\Makefile2:2943: recipe for target 'Testing/MATGEN/CMakeFiles/tmglib.dir/all' failed
mingw32-make[1]: *** [Testing/MATGEN/CMakeFiles/tmglib.dir/all] Error 2
Makefile:161: recipe for target 'all' failed
mingw32-make: *** [all] Error 2


Can anyone help me with this problem? What was going on here? Thanks in advance!
xusunpku
 
Posts: 1
Joined: Thu Mar 02, 2017 4:04 am

Return to Windows

Who is online

Users browsing this forum: No registered users and 1 guest