A new lapack tests fail

Post here if you have a question about the installation process

A new lapack tests fail

Postby haevee » Thu Dec 04, 2014 1:15 am

stest-out.txt
stest-out.txt
(30.16 KiB) Downloaded 38 times
Hi Julien,
My operating system information is listed:
LSB Version: :core-4.0-amd64:core-4.0-noarch:graphics-4.0-amd64:graphics-4.0-noarch:printing-4.0-amd64:printing-4.0-noarch
Distributor ID: RedHatEnterpriseServer
Description: Red Hat Enterprise Linux Server release 6.0 (Santiago)
Release: 6.0
Codename: Santiago

I came to some concluse after compiling lapack on it. Firstly, I met the problem:
stbt05.f: In function ‘stbt05’:
stbt05.f:189: internal compiler error: Segmentation fault
Please submit a full bug report,
with preprocessed source if appropriate.
See <http://bugzilla.redhat.com/bugzilla> for instructions.
make[2]: *** [stbt05.o] Error 1
make[2]: Leaving directory `/downloads/lapack-3.5.0/TESTING/LIN'
make[1]: *** [xlintsts] Error 2
make[1]: Leaving directory `/downloads/lapack-3.5.0/TESTING'
make: *** [lapack_testing] Error 2.
and I did type: "gfortran -O3 -frecursive -c stbt05.f -o stbt05.o", (in TESTING/LIN), then retype "make" on the top directory, and this work well.

But, then it again gave another problem:
stpt05.f: In function ‘stpt05’:
stpt05.f:174: internal compiler error: Segmentation fault
Please submit a full bug report,
with preprocessed source if appropriate.
See <http://bugzilla.redhat.com/bugzilla> for instructions.
make[2]: *** [stpt05.o] Error 1
make[2]: Leaving directory `/downloads/lapack-3.5.0/TESTING/LIN'
make[1]: *** [xlintsts] Error 2
make[1]: Leaving directory `/downloads/lapack-3.5.0/TESTING'
make: *** [lapack_testing] Error 2.
and I did type: "g77 -O3 -c stpt05.f -o stpt05.o", (in TESTING/LIN), then retype "make" on the top directory, and this work well.

and so on, these errors also occured for ctbt05.f, ctpt05.f, dtbt05.f, dtpt05.f, ztbt05.f, ztpt05.f. And I deal with them as the above recipes. It seems all things are OK.

But when I run "./lapack_testing.py -e -p x -t all", the results are below :
lapack_testing_results.txt
lapack_testing_results.txt
(8.4 KiB) Downloaded 46 times

stest-out.txt
stest-out.txt
(30.16 KiB) Downloaded 38 times


I don't know why does it test failed. How can I do ? I hope someone could answer me, thank you very much !
haevee
 
Posts: 2
Joined: Wed Dec 03, 2014 10:27 am

Return to Installation

Who is online

Users browsing this forum: No registered users and 3 guests