PAPI build error on XT5

PAPI build error on XT5

Postby tcortese » Thu May 06, 2010 3:39 pm


Is this the appropriate place to report a build error? I'm trying to build PAPI on an XT5 system, and all looks good until I get the following error (see below). I think I may be able to go in and hack the makefile to get this to work, but I thought I would see if you had any suggestions...

-Tom Cortese

f77 -I../ctests -I. -I.. -Wall -ffixed-line-length-132 -Dlinux -c ftests_util.F
/opt/cray/xt-asyncpe/3.3/bin/f77: INFO: linux target is being used
pgf77-Error-Unknown switch: -Wall
pgf77-Error-Unknown switch: -ffixed-line-length-132
gmake[3]: *** [ftests_util.o] Error 1
gmake[3]: Leaving directory `/lustre/small/u2/wes/PET_HOME/src/papi-'
gmake[2]: *** [ftests] Error 2
gmake[2]: Leaving directory `/lustre/small/u2/wes/PET_HOME/src/papi-'
gmake[1]: *** [/lustre/small/u2/wes/PET_HOME/src/papi-] Error 2
gmake[1]: Leaving directory `/lustre/small/u2/wes/PET_HOME/src/papi-'
gmake: *** [/lustre/small/u2/wes/PET_HOME/src/papi-] Error 2
Posts: 2
Joined: Fri Oct 30, 2009 3:53 pm

Return to Component PAPI (PAPI-C)

Who is online

Users browsing this forum: No registered users and 1 guest